Reaction Details
TargetGlutamate receptor ionotropic, kainate 1
LigandBDBM50207594
Substrate/Competitorn/a
Meas. Tech.ChEMBL_341803 (CHEMBL865005)
IC50 37000±n/a nM
Citation Dolman, NPMore, JCAlt, AKnauss, JLTroop, HMBleakman, DCollingridge, GLJane, DE Structure-activity relationship studies on N3-substituted willardiine derivatives acting as AMPA or kainate receptor antagonists. J Med Chem49:2579-92 (2006) 
 
Glutamate receptor ionotropic, kainate 1
Name:Glutamate receptor ionotropic, kainate 1
Type:Enzyme Catalytic Domain
Mol. Mass.:103984.96
Organism:Homo sapiens (Human)
Description:P39086
Residue:918
BDBM50207594
NameBDBM50207594
Synonyms:2,3-Dihydroxy-6-nitro-benzo[f]quinoxaline-7-sulfonic acid amide 2,3-dihydroxy-6-nitro-7-sulfamoylbenzo(f)quinoxaline 6-Nitro-2,3-dioxo-1,2,3,4,4a,10b-hexahydro-benzo[f]quinoxaline-7-sulfonic acid amide 6-Nitro-2,3-dioxo-1,2,3,4-tetrahydro-benzo[f]quinoxaline-7-sulfonic acid amide 6-nitro-2,3-dioxo-1,2,3,4-tetrahydrobenzo[f]quinoxaline-7-sulfonamide | CHEMBL222519
TypeSmall organic molecule
Emp. Form.C12H8N4O6S
Mol. Mass.336.28
SMILESNS(=O)(=O)c1cccc2c1c(cc1[nH]c(=O)c(=O)[nH]c21)[N+]([O-])=O