Reaction Details
TargetGlutamate receptor 2
LigandBDBM50207594
Substrate/Competitorn/a
Meas. Tech.ChEMBL_341813 (CHEMBL865015)
IC50 2500±n/a nM
Citation Dolman, NPMore, JCAlt, AKnauss, JLTroop, HMBleakman, DCollingridge, GLJane, DE Structure-activity relationship studies on N3-substituted willardiine derivatives acting as AMPA or kainate receptor antagonists. J Med Chem49:2579-92 (2006) 
 
Glutamate receptor 2
Name:Glutamate receptor 2
Type:Enzyme Catalytic Domain
Mol. Mass.:98825.96
Organism:Homo sapiens (Human)
Description:Glutamate AMPA 2 GRIA2 HUMAN::P42262
Residue:883
BDBM50207594
NameBDBM50207594
Synonyms:2,3-Dihydroxy-6-nitro-benzo[f]quinoxaline-7-sulfonic acid amide 2,3-dihydroxy-6-nitro-7-sulfamoylbenzo(f)quinoxaline 6-Nitro-2,3-dioxo-1,2,3,4,4a,10b-hexahydro-benzo[f]quinoxaline-7-sulfonic acid amide 6-Nitro-2,3-dioxo-1,2,3,4-tetrahydro-benzo[f]quinoxaline-7-sulfonic acid amide 6-nitro-2,3-dioxo-1,2,3,4-tetrahydrobenzo[f]quinoxaline-7-sulfonamide | CHEMBL222519
TypeSmall organic molecule
Emp. Form.C12H8N4O6S
Mol. Mass.336.28
SMILESNS(=O)(=O)c1cccc2c1c(cc1[nH]c(=O)c(=O)[nH]c21)[N+]([O-])=O