Reaction Details
Target1-deoxy-D-xylulose 5-phosphate reductoisomerase
LigandBDBM50181153
Substrate/Competitorn/a
Meas. Tech.ChEMBL_344886 (CHEMBL870710)
IC50 58±n/a nM
Citation Devreux, VWiesner, JGoeman, JLVan der Eycken, JJomaa, HVan Calenbergh, S Synthesis and biological evaluation of cyclopropyl analogues of fosmidomycin as potent Plasmodium falciparum growth inhibitors. J Med Chem49:2656-60 (2006) 
 
1-deoxy-D-xylulose 5-phosphate reductoisomerase
Name:1-deoxy-D-xylulose 5-phosphate reductoisomerase
Type:Protein
Mol. Mass.:43384.52
Organism:Escherichia coli
Description:P45568
Residue:398
BDBM50181153
NameBDBM50181153
Synonyms:3-(N-hydroxyacetamido)propylphosphonic acid CHEMBL205338 ammonium 3-(N-hydroxyacetamido)propylphosphonate
TypeSmall organic molecule
Emp. Form.C5H12NO5P
Mol. Mass.197.1262
SMILESCC(=O)N(O)CCCP(O)(O)=O