Reaction Details
TargetAP2-associated protein kinase 1
LigandBDBM311189
Substrate/Competitorn/a
Meas. Tech.ChEMBL_2246936 (CHEMBL5161146)
Ki 0.050000±n/a nM
Citation Luo, GChen, LKostich, WAHamman, BAllen, JEaston, ABourin, CGulianello, MLippy, JNara, SPattipati, SNDandapani, KDokania, MVattikundala, PSharma, VElavazhagan, SVerma, MKLal Das, MWagh, SBalakrishnan, AJohnson, BMSantone, KSThalody, GDenton, RSaminathan, HHolenarsipur, VKKumar, ARao, APutlur, SPSarvasiddhi, SKShankar, GLouis, JVRamarao, MConway, CMLi, YWPieschl, RTian, YHong, YBristow, LAlbright, CFBronson, JJMacor, JEDzierba, CD Discovery and Optimization of Biaryl Alkyl Ethers as a Novel Class of Highly Selective, CNS-Penetrable, and Orally Active Adaptor Protein-2-Associated Kinase 1 (AAK1) Inhibitors for the Potential Treatment of Neuropathic Pain. J Med Chem65:4534-4564 (2022) 
 
AP2-associated protein kinase 1
Name:AP2-associated protein kinase 1
Type:PROTEIN
Mol. Mass.:103346.52
Organism:Mus musculus
Description:ChEMBL_120693
Residue:959
BDBM311189
NameBDBM311189
Synonyms:(S)-methyl (4-(4-((2-amino-2,4-dimethylpentyl)oxy)-3-cyclopropylphenyl)pyridin-2-yl)carbamate US10351563, Example 33 US10723734, Example 33 US9902722, Example 33
TypeSmall organic molecule
Emp. Form.C23H31N3O3
Mol. Mass.397.5105
SMILESCOC(=O)Nc1cc(ccn1)-c1ccc(OC[C@@](C)(N)CC(C)C)c(c1)C1CC1