Reaction Details
TargetAP2-associated protein kinase 1
LigandBDBM50604140
Substrate/Competitorn/a
Meas. Tech.ChEMBL_2246936 (CHEMBL5161146)
Ki 0.150000±n/a nM
Citation Luo, GChen, LKostich, WAHamman, BAllen, JEaston, ABourin, CGulianello, MLippy, JNara, SPattipati, SNDandapani, KDokania, MVattikundala, PSharma, VElavazhagan, SVerma, MKLal Das, MWagh, SBalakrishnan, AJohnson, BMSantone, KSThalody, GDenton, RSaminathan, HHolenarsipur, VKKumar, ARao, APutlur, SPSarvasiddhi, SKShankar, GLouis, JVRamarao, MConway, CMLi, YWPieschl, RTian, YHong, YBristow, LAlbright, CFBronson, JJMacor, JEDzierba, CD Discovery and Optimization of Biaryl Alkyl Ethers as a Novel Class of Highly Selective, CNS-Penetrable, and Orally Active Adaptor Protein-2-Associated Kinase 1 (AAK1) Inhibitors for the Potential Treatment of Neuropathic Pain. J Med Chem65:4534-4564 (2022) 
 
AP2-associated protein kinase 1
Name:AP2-associated protein kinase 1
Type:PROTEIN
Mol. Mass.:103346.52
Organism:Mus musculus
Description:ChEMBL_120693
Residue:959
BDBM50604140
NameBDBM50604140
Synonyms:CHEMBL5185000
TypeSmall organic molecule
Emp. Form.C20H25N5O3
Mol. Mass.383.4442
SMILESCOC(=O)Nc1cc(ccn1)-c1cnc(OC[C@@](C)(N)CC(C)C)c(c1)C#N