Reaction Details
TargetIntegrin alpha-V/beta-3
LigandBDBM50185468
Substrate/Competitorn/a
Meas. Tech.ChEMBL_360911 (CHEMBL870872)
IC50 0.75±n/a nM
Citation Penning, TDKhilevich, AChen, BBRussell, MABoys, MLWang, YDuffin, TEngleman, VWFinn, MBFreeman, SKHanneke, MLKeene, JLKlover, JANickols, GANickols, MARader, RKSettle, SLShannon, KESteininger, CNWestlin, MMWestlin, WF Synthesis of pyrazoles and isoxazoles as potent alpha(v)beta3 receptor antagonists. Bioorg Med Chem Lett16:3156-61 (2006) 
 
Integrin alpha-V/beta-3
Name:Integrin alpha-V/beta-3
Type:Enzyme
Mol. Mass.:n/a
Description:n/a
Components:This complex has 2 components.
Component 1
Name:Integrin alpha-V
Synonyms:ITAV_HUMAN Integrin alpha-V/alpha-5 VNRA Vitronectin receptor | Vitronectin receptor subunit alpha
Type:PROTEIN
Mol. Mass.:116024.92
Organism:Homo sapiens (Human)
Description:ChEMBL_582336
Residue:1048
Component 2
Name:Integrin beta-3
Synonyms:CD_antigen=CD61 GPIIIa ITGB3 Platelet membrane glycoprotein IIIa
Type:Protein
Mol. Mass.:87038.91
Organism:Homo sapiens (Human)
Description:P05106
Residue:788
BDBM50185468
NameBDBM50185468
Synonyms:3-(benzo[d][1,3]dioxol-5-yl)-4-(1-methyl-5-(2-(1-methyl-1,2,3,4-tetrahydropyrido[2,3-b]pyrazin-6-yl)ethoxy)-1H-pyrazol-3-yl)butanoic acid | CHEMBL207414
TypeSmall organic molecule
Emp. Form.C25H29N5O5
Mol. Mass.479.5283
SMILESCN1CCNc2nc(CCOc3cc(CC(CC(O)=O)c4ccc5OCOc5c4)nn3C)ccc12