Reaction Details
TargetIntegrin alpha-V/beta-3
LigandBDBM50185454
Substrate/Competitorn/a
Meas. Tech.ChEMBL_360910 (CHEMBL870871)
IC50 0.9±n/a nM
Citation Penning, TDKhilevich, AChen, BBRussell, MABoys, MLWang, YDuffin, TEngleman, VWFinn, MBFreeman, SKHanneke, MLKeene, JLKlover, JANickols, GANickols, MARader, RKSettle, SLShannon, KESteininger, CNWestlin, MMWestlin, WF Synthesis of pyrazoles and isoxazoles as potent alpha(v)beta3 receptor antagonists. Bioorg Med Chem Lett16:3156-61 (2006) 
 
Integrin alpha-V/beta-3
Name:Integrin alpha-V/beta-3
Type:Enzyme
Mol. Mass.:n/a
Description:n/a
Components:This complex has 2 components.
Component 1
Name:Integrin alpha-V
Synonyms:ITAV_HUMAN Integrin alpha-V/alpha-5 VNRA Vitronectin receptor | Vitronectin receptor subunit alpha
Type:PROTEIN
Mol. Mass.:116024.92
Organism:Homo sapiens (Human)
Description:ChEMBL_582336
Residue:1048
Component 2
Name:Integrin beta-3
Synonyms:CD_antigen=CD61 GPIIIa ITGB3 Platelet membrane glycoprotein IIIa
Type:Protein
Mol. Mass.:87038.91
Organism:Homo sapiens (Human)
Description:P05106
Residue:788
BDBM50185454
NameBDBM50185454
Synonyms:3-(6-methoxypyridin-3-yl)-4-(3-(2-(5,6,7,8-tetrahydro-1,8-naphthyridin-2-yl)ethoxy)isoxazol-5-yl)butanoic acid | CHEMBL208186
TypeSmall organic molecule
Emp. Form.C23H26N4O5
Mol. Mass.438.4763
SMILESCOc1ccc(cn1)C(CC(O)=O)Cc1cc(OCCc2ccc3CCCNc3n2)no1