Reaction Details
TargetIntegrin alpha-V/beta-3
LigandBDBM50185465
Substrate/Competitorn/a
Meas. Tech.ChEMBL_360910 (CHEMBL870871)
IC50 0.83±n/a nM
Citation Penning, TDKhilevich, AChen, BBRussell, MABoys, MLWang, YDuffin, TEngleman, VWFinn, MBFreeman, SKHanneke, MLKeene, JLKlover, JANickols, GANickols, MARader, RKSettle, SLShannon, KESteininger, CNWestlin, MMWestlin, WF Synthesis of pyrazoles and isoxazoles as potent alpha(v)beta3 receptor antagonists. Bioorg Med Chem Lett16:3156-61 (2006) 
 
Integrin alpha-V/beta-3
Name:Integrin alpha-V/beta-3
Type:Enzyme
Mol. Mass.:n/a
Description:n/a
Components:This complex has 2 components.
Component 1
Name:Integrin alpha-V
Synonyms:ITAV_HUMAN Integrin alpha-V/alpha-5 VNRA Vitronectin receptor | Vitronectin receptor subunit alpha
Type:PROTEIN
Mol. Mass.:116024.92
Organism:Homo sapiens (Human)
Description:ChEMBL_582336
Residue:1048
Component 2
Name:Integrin beta-3
Synonyms:CD_antigen=CD61 GPIIIa ITGB3 Platelet membrane glycoprotein IIIa
Type:Protein
Mol. Mass.:87038.91
Organism:Homo sapiens (Human)
Description:P05106
Residue:788
BDBM50185465
NameBDBM50185465
Synonyms:3-(benzo[d][1,3]dioxol-5-yl)-4-(1-methyl-5-(2-(1,2,3,4-tetrahydropyrido[2,3-b]pyrazin-6-yl)ethoxy)-1H-pyrazol-3-yl)butanoic acid | CHEMBL262123
TypeSmall organic molecule
Emp. Form.C24H27N5O5
Mol. Mass.465.5017
SMILESCn1nc(CC(CC(O)=O)c2ccc3OCOc3c2)cc1OCCc1ccc2NCCNc2n1