Reaction Details
TargetGamma-aminobutyric acid receptor subunit alpha-3/beta-3/gamma-2
LigandBDBM50185502
Substrate/Competitorn/a
Meas. Tech.ChEMBL_373310 (CHEMBL853517)
Ki 1.4±n/a nM
Citation Carling, RWRussell, MGMoore, KWMitchinson, AGuiblin, ASmith, AWafford, KAMarshall, GAtack, JRStreet, LJ 2,3,7-Trisubstituted pyrazolo[1,5-d][1,2,4]triazines: functionally selective GABAA alpha3-subtype agonists. Bioorg Med Chem Lett16:3550-4 (2006) 
 
Gamma-aminobutyric acid receptor subunit alpha-3/beta-3/gamma-2
Name:Gamma-aminobutyric acid receptor subunit alpha-3/beta-3/gamma-2
Type:n/a
Mol. Mass.:n/a
Description:ASSAY_ID of EBI is 68410
Components:This complex has 3 components.
Component 1
Name:Gamma-aminobutyric acid receptor subunit gamma-2
Synonyms:GABA(A) receptor subunit gamma-2 GBRG2_HUMAN
Type:PROTEIN
Mol. Mass.:54172.74
Organism:Homo sapiens (Human)
Description:EBI_217
Residue:467
Component 2
Name:Gamma-aminobutyric acid receptor subunit beta-3
Synonyms:GABA A receptor alpha-4/beta-3/gamma-2 GABA-A receptor GBRB3_HUMAN | agonist GABA site
Type:PROTEIN
Mol. Mass.:54130.51
Organism:Homo sapiens (Human)
Description:ChEMBL_448071
Residue:473
Component 3
Name:Gamma-aminobutyric acid receptor subunit alpha-3
Synonyms:GABA A Alpha3Beta3Gamma2 GABA C GABA-A receptor GBRA3_HUMAN agonist GABA site
Type:Enzyme Catalytic Domain
Mol. Mass.:55175.47
Organism:Homo sapiens (Human)
Description:GABA A Alpha3Beta1Gamma2 0 HUMAN::P34903
Residue:492
BDBM50185502
NameBDBM50185502
Synonyms:7-(2-fluorophenyl)-2-((2-methyl-2H-1,2,4-triazol-3-yl)methoxy)-3-(pyridin-2-yl)pyrazolo[1,5-d][1,2,4]triazine | CHEMBL208998
TypeSmall organic molecule
Emp. Form.C20H15FN8O
Mol. Mass.402.3845
SMILESCn1ncnc1COc1nn2c(nncc2c1-c1ccccn1)-c1ccccc1F