Reaction Details
TargetProteasome subunit beta type-8
LigandBDBM50604283
Substrate/Competitorn/a
Meas. Tech.ChEMBL_2247504 (CHEMBL5161714)
IC50 3.5±n/a nM
Citation Nan, GHuang, LLi, YYang, YYang, YLi, KLai, FChen, XXiao, Z Identification of N, C-capped di- and tripeptides as selective immunoproteasome inhibitors. Eur J Med Chem234:0 (2022) 
 
Proteasome subunit beta type-8
Name:Proteasome subunit beta type-8
Type:PROTEIN
Mol. Mass.:30357.49
Organism:Homo sapiens (Human)
Description:ChEMBL_1446797
Residue:276
BDBM50604283
NameBDBM50604283
Synonyms:CHEMBL5172323
TypeSmall organic molecule
Emp. Form.C37H52ClN7O7
Mol. Mass.742.304
SMILESCc1ccc(CNC(=O)[C@H](Cc2ccccc2)NC(=O)[C@H](CCC(=O)NC(C)(C)C)NC(=O)[C@H](CNC(=O)CCl)NC(=O)CN2CCOCC2)cc1