Reaction Details
TargetProteasome subunit beta type-8
LigandBDBM50604287
Substrate/Competitorn/a
Meas. Tech.ChEMBL_2247504 (CHEMBL5161714)
IC50 1.2±n/a nM
Citation Nan, GHuang, LLi, YYang, YYang, YLi, KLai, FChen, XXiao, Z Identification of N, C-capped di- and tripeptides as selective immunoproteasome inhibitors. Eur J Med Chem234:0 (2022) 
 
Proteasome subunit beta type-8
Name:Proteasome subunit beta type-8
Type:PROTEIN
Mol. Mass.:30357.49
Organism:Homo sapiens (Human)
Description:ChEMBL_1446797
Residue:276
BDBM50604287
NameBDBM50604287
Synonyms:CHEMBL5201806
TypeSmall organic molecule
Emp. Form.C41H53ClN6O6
Mol. Mass.761.349
SMILESCc1ccc(CNC(=O)[C@H](Cc2ccccc2)NC(=O)[C@H](CCC(=O)NC(C)(C)C)NC(=O)[C@H](CNC(=O)CCl)NC(=O)CCCc2ccccc2)cc1