Reaction Details
TargetProteasome subunit beta type-8
LigandBDBM50604290
Substrate/Competitorn/a
Meas. Tech.ChEMBL_2247504 (CHEMBL5161714)
IC50 0.940000±n/a nM
Citation Nan, GHuang, LLi, YYang, YYang, YLi, KLai, FChen, XXiao, Z Identification of N, C-capped di- and tripeptides as selective immunoproteasome inhibitors. Eur J Med Chem234:0 (2022) 
 
Proteasome subunit beta type-8
Name:Proteasome subunit beta type-8
Type:PROTEIN
Mol. Mass.:30357.49
Organism:Homo sapiens (Human)
Description:ChEMBL_1446797
Residue:276
BDBM50604290
NameBDBM50604290
Synonyms:CHEMBL5175132
TypeSmall organic molecule
Emp. Form.C38H49ClN6O7S
Mol. Mass.769.35
SMILESCc1ccc(CNC(=O)[C@H](Cc2ccccc2)NC(=O)[C@H](CCC(=O)NC(C)(C)C)NC(=O)[C@H](CNC(=O)CCl)NS(=O)(=O)c2ccc(C)cc2)cc1