Reaction Details
TargetProteasome subunit beta type-8
LigandBDBM50604322
Substrate/Competitorn/a
Meas. Tech.ChEMBL_2247504 (CHEMBL5161714)
IC50 3.7±n/a nM
Citation Nan, GHuang, LLi, YYang, YYang, YLi, KLai, FChen, XXiao, Z Identification of N, C-capped di- and tripeptides as selective immunoproteasome inhibitors. Eur J Med Chem234:0 (2022) 
 
Proteasome subunit beta type-8
Name:Proteasome subunit beta type-8
Type:PROTEIN
Mol. Mass.:30357.49
Organism:Homo sapiens (Human)
Description:ChEMBL_1446797
Residue:276
BDBM50604322
NameBDBM50604322
Synonyms:CHEMBL5198483
TypeSmall organic molecule
Emp. Form.C39H45ClN6O5
Mol. Mass.713.265
SMILESCc1ccc(CNC(=O)[C@H](Cc2ccccc2)NC(=O)[C@H](CCC(=O)NC(C)(C)C)NC(=O)CCNC(=O)C(=C\c2ccc(Cl)cc2)\C#N)cc1