Reaction Details
TargetProteasome subunit beta type-8
LigandBDBM50604324
Substrate/Competitorn/a
Meas. Tech.ChEMBL_2247504 (CHEMBL5161714)
IC50 2.9±n/a nM
Citation Nan, GHuang, LLi, YYang, YYang, YLi, KLai, FChen, XXiao, Z Identification of N, C-capped di- and tripeptides as selective immunoproteasome inhibitors. Eur J Med Chem234:0 (2022) 
 
Proteasome subunit beta type-8
Name:Proteasome subunit beta type-8
Type:PROTEIN
Mol. Mass.:30357.49
Organism:Homo sapiens (Human)
Description:ChEMBL_1446797
Residue:276
BDBM50604324
NameBDBM50604324
Synonyms:CHEMBL5183361
TypeSmall organic molecule
Emp. Form.C37H44N6O6
Mol. Mass.668.7819
SMILESCc1ccc(CNC(=O)[C@H](Cc2ccccc2)NC(=O)[C@H](CCC(=O)NC(C)(C)C)NC(=O)CCNC(=O)C(=C\c2ccco2)\C#N)cc1