Reaction Details
TargetProteasome subunit beta type-8
LigandBDBM50604327
Substrate/Competitorn/a
Meas. Tech.ChEMBL_2247504 (CHEMBL5161714)
IC50 1.7±n/a nM
Citation Nan, GHuang, LLi, YYang, YYang, YLi, KLai, FChen, XXiao, Z Identification of N, C-capped di- and tripeptides as selective immunoproteasome inhibitors. Eur J Med Chem234:0 (2022) 
 
Proteasome subunit beta type-8
Name:Proteasome subunit beta type-8
Type:PROTEIN
Mol. Mass.:30357.49
Organism:Homo sapiens (Human)
Description:ChEMBL_1446797
Residue:276
BDBM50604327
NameBDBM50604327
Synonyms:CHEMBL5202276
TypeSmall organic molecule
Emp. Form.C46H47ClN6O5
Mol. Mass.799.356
SMILESCC(C)(C)NC(=O)CC[C@H](NC(=O)CCNC(=O)C(=C\c1ccc(Cl)cc1)\C#N)C(=O)N[C@@H](Cc1ccc2ccccc2c1)C(=O)NCc1cccc2ccccc12