Reaction Details
TargetProteasome subunit beta type-8
LigandBDBM50604328
Substrate/Competitorn/a
Meas. Tech.ChEMBL_2247504 (CHEMBL5161714)
IC50 1.1±n/a nM
Citation Nan, GHuang, LLi, YYang, YYang, YLi, KLai, FChen, XXiao, Z Identification of N, C-capped di- and tripeptides as selective immunoproteasome inhibitors. Eur J Med Chem234:0 (2022) 
 
Proteasome subunit beta type-8
Name:Proteasome subunit beta type-8
Type:PROTEIN
Mol. Mass.:30357.49
Organism:Homo sapiens (Human)
Description:ChEMBL_1446797
Residue:276
BDBM50604328
NameBDBM50604328
Synonyms:CHEMBL5180795
TypeSmall organic molecule
Emp. Form.C38H44ClN5O5
Mol. Mass.686.239
SMILESCC(C)(C)NC(=O)CC[C@H](NC(=O)CCNC(=O)CCl)C(=O)N[C@@H](Cc1ccc2ccccc2c1)C(=O)NCc1cccc2ccccc12