Reaction Details
TargetProteasome subunit beta type-8
LigandBDBM50604330
Substrate/Competitorn/a
Meas. Tech.ChEMBL_2247504 (CHEMBL5161714)
IC50 2.6±n/a nM
Citation Nan, GHuang, LLi, YYang, YYang, YLi, KLai, FChen, XXiao, Z Identification of N, C-capped di- and tripeptides as selective immunoproteasome inhibitors. Eur J Med Chem234:0 (2022) 
 
Proteasome subunit beta type-8
Name:Proteasome subunit beta type-8
Type:PROTEIN
Mol. Mass.:30357.49
Organism:Homo sapiens (Human)
Description:ChEMBL_1446797
Residue:276
BDBM50604330
NameBDBM50604330
Synonyms:CHEMBL5207139
TypeSmall organic molecule
Emp. Form.C35H45N5O5
Mol. Mass.615.7623
SMILESCCC(=O)NCCC(=O)N[C@@H](CCC(=O)NC(C)(C)C)C(=O)N[C@@H](Cc1ccccc1)C(=O)NCc1cccc2ccccc12