Reaction Details
TargetAmyloid-beta precursor protein
LigandBDBM50185950
Substrate/Competitorn/a
Meas. Tech.ChEMBL_351617 (CHEMBL870087)
Ki 2.8±n/a nM
Citation Ono, MKawashima, HNonaka, AKawai, THaratake, MMori, HKung, MPKung, HFSaji, HNakayama, M Novel benzofuran derivatives for PET imaging of beta-amyloid plaques in Alzheimer's disease brains. J Med Chem49:2725-30 (2006) 
 
Amyloid-beta precursor protein
Name:Amyloid-beta precursor protein
Type:Single-pass type I membrane protein
Mol. Mass.:86890.41
Organism:Homo sapiens (Human)
Description:P05067
Residue:770
BDBM50185950
NameBDBM50185950
Synonyms:5-hydroxy-2-(4-dimethylaminophenyl)benzofuran | CHEMBL204414
TypeSmall organic molecule
Emp. Form.C16H15NO2
Mol. Mass.253.2958
SMILESCN(C)c1ccc(cc1)-c1cc2cc(O)ccc2o1