Reaction Details
TargetC-C chemokine receptor type 5
LigandBDBM50185972
Substrate/Competitorn/a
Meas. Tech.ChEMBL_351942 (CHEMBL870788)
IC50 1.2±n/a nM
Citation Imamura, SIchikawa, TNishikawa, YKanzaki, NTakashima, KNiwa, SIizawa, YBaba, MSugihara, Y Discovery of a piperidine-4-carboxamide CCR5 antagonist (TAK-220) with highly potent Anti-HIV-1 activity. J Med Chem49:2784-93 (2006) 
 
C-C chemokine receptor type 5
Name:C-C chemokine receptor type 5
Type:Enzyme
Mol. Mass.:40540.21
Organism:Homo sapiens (Human)
Description:P51681
Residue:352
BDBM50185972
NameBDBM50185972
Synonyms:CHEMBL207182 | N-(3-(4-(4-fluorobenzyl)piperidin-1-yl)propyl)-1-acetyl-N-(3,4-dichlorophenyl)piperidine-4-carboxamide
TypeSmall organic molecule
Emp. Form.C29H36Cl2FN3O2
Mol. Mass.548.519
SMILESCC(=O)N1CCC(CC1)C(=O)N(CCCN1CCC(Cc2ccc(F)cc2)CC1)c1ccc(Cl)c(Cl)c1