Reaction Details
TargetC-C chemokine receptor type 5
LigandBDBM50185979
Substrate/Competitorn/a
Meas. Tech.ChEMBL_351942 (CHEMBL870788)
IC50 3.5±n/a nM
Citation Imamura, SIchikawa, TNishikawa, YKanzaki, NTakashima, KNiwa, SIizawa, YBaba, MSugihara, Y Discovery of a piperidine-4-carboxamide CCR5 antagonist (TAK-220) with highly potent Anti-HIV-1 activity. J Med Chem49:2784-93 (2006) 
 
C-C chemokine receptor type 5
Name:C-C chemokine receptor type 5
Type:Enzyme
Mol. Mass.:40540.21
Organism:Homo sapiens (Human)
Description:P51681
Residue:352
BDBM50185979
NameBDBM50185979
Synonyms:1-acetyl-N-{3-[4-(4-carbamoylbenzyl)piperidin-1-yl]propyl}-N-(3-chloro-4-methylphenyl)piperidine-4-carboxamide TAK-220
TypeSmall organic molecule
Emp. Form.C31H41ClN4O3
Mol. Mass.553.135
SMILESCC(=O)N1CCC(CC1)C(=O)N(CCCN1CCC(Cc2ccc(cc2)C(N)=O)CC1)c1ccc(C)c(Cl)c1