Reaction Details
TargetAmyloid-beta precursor protein
LigandBDBM50185991
Substrate/Competitorn/a
Meas. Tech.ChEMBL_353056 (CHEMBL865747)
Ki 7.5±n/a nM
Citation Zhuang, ZPKung, MPKung, HF Synthesis of biphenyltrienes as probes for beta-amyloid plaques. J Med Chem49:2841-4 (2006) 
 
Amyloid-beta precursor protein
Name:Amyloid-beta precursor protein
Type:Single-pass type I membrane protein
Mol. Mass.:86890.41
Organism:Homo sapiens (Human)
Description:P05067
Residue:770
BDBM50185991
NameBDBM50185991
Synonyms:1,6-bis(4'-methylaminophenyl)-hexa-1,3,5-triene | CHEMBL208457
TypeSmall organic molecule
Emp. Form.C20H22N2
Mol. Mass.290.4021
SMILESCNc1ccc(\C=C\C=C\C=C\c2ccc(NC)cc2)cc1