Reaction Details
TargetProstaglandin G/H synthase 2
LigandBDBM22369
Substrate/Competitorn/a
Meas. Tech.ChEMBL_374847 (CHEMBL864093)
IC50 760±n/a nM
Citation Caturla, FAmat, MReinoso, RFCalaf, EWarrellow, G Racemic and chiral sulfoxides as potential prodrugs of 4-pyrone COX-2 inhibitors. Bioorg Med Chem Lett16:3605-8 (2006) 
 
Prostaglandin G/H synthase 2
Name:Prostaglandin G/H synthase 2
Type:Enzyme
Mol. Mass.:69003.89
Organism:Homo sapiens (Human)
Description:Recombinant Cox-2 provided by Cayman (Cayman Chemical Co.,Ann Arbor, MI).
Residue:604
BDBM22369
NameBDBM22369
Synonyms:4-(4-methanesulfonylphenyl)-3-phenyl-2,5-dihydrofuran-2-one MK 0966 US11478464, Compound Rofecoxib | US11786535, Compound Rofecoxib
TypeSmall organic molecule
Emp. Form.C17H14O4S
Mol. Mass.314.356
SMILESCS(=O)(=O)c1ccc(cc1)C1=C(C(=O)OC1)c1ccccc1