Reaction Details
TargetHistamine H3 receptor
LigandBDBM50186278
Substrate/Competitorn/a
Meas. Tech.ChEMBL_370711 (CHEMBL867234)
Ki 1.29±n/a nM
Citation Jesudason, CDBeavers, LSCramer, JWDill, JFinley, DRLindsley, CWStevens, FCGadski, RAOldham, SWPickard, RTSiedem, CSSindelar, DKSingh, AWatson, BMHipskind, PA Synthesis and SAR of novel histamine H3 receptor antagonists. Bioorg Med Chem Lett16:3415-8 (2006) 
 
Histamine H3 receptor
Name:Histamine H3 receptor
Type:G Protein-Coupled Receptor (GPCR)
Mol. Mass.:48607.98
Organism:Rattus norvegicus (rat)
Description:n/a
Residue:445
BDBM50186278
NameBDBM50186278
Synonyms:2-isopropyl-7-(3-(piperidin-1-yl)propoxy)-2,3,4,5-tetrahydro-1H-benzo[c]azepine | CHEMBL210051
TypeSmall organic molecule
Emp. Form.C21H34N2O
Mol. Mass.330.5075
SMILESCC(C)N1CCCc2cc(OCCCN3CCCCC3)ccc2C1