Reaction Details
TargetHistamine H3 receptor
LigandBDBM50186290
Substrate/Competitorn/a
Meas. Tech.ChEMBL_370710 (CHEMBL867233)
Ki 0.26±n/a nM
Citation Jesudason, CDBeavers, LSCramer, JWDill, JFinley, DRLindsley, CWStevens, FCGadski, RAOldham, SWPickard, RTSiedem, CSSindelar, DKSingh, AWatson, BMHipskind, PA Synthesis and SAR of novel histamine H3 receptor antagonists. Bioorg Med Chem Lett16:3415-8 (2006) 
 
Histamine H3 receptor
Name:Histamine H3 receptor
Type:G Protein-Coupled Receptor (GPCR)
Mol. Mass.:48691.47
Organism:Homo sapiens (Human)
Description:Binding assays were using CHO cells stably expressing hH3R receptors.
Residue:445
BDBM50186290
NameBDBM50186290
Synonyms:3-ethyl-7-(3-(piperidin-1-yl)propoxy)-2,3,4,5-tetrahydro-1H-benzo[d]azepine | CHEMBL207078
TypeSmall organic molecule
Emp. Form.C20H32N2O
Mol. Mass.316.4809
SMILESCCN1CCc2ccc(OCCCN3CCCCC3)cc2CC1