Reaction Details
TargetAdenosine receptor A1
LigandBDBM50186599
Substrate/Competitorn/a
Meas. Tech.ChEMBL_353090 (CHEMBL866934)
Ki 0.73±n/a nM
Citation Chang, LCSpanjersberg, RFvon Frijtag Drabbe Künzel, JKMulder-Krieger, TBrussee, JIjzerman, AP 2,6-disubstituted and 2,6,8-trisubstituted purines as adenosine receptor antagonists. J Med Chem49:2861-7 (2006) 
 
Adenosine receptor A1
Name:Adenosine receptor A1
Type:G Protein-Coupled Receptor (GPCR)
Mol. Mass.:36520.92
Organism:Homo sapiens (Human)
Description:P30542
Residue:326
BDBM50186599
NameBDBM50186599
Synonyms:8-cyclohexyl-2,6-diphenyl-9H-purine LUF-5957
TypeSmall organic molecule
Emp. Form.C23H22N4
Mol. Mass.354.4476
SMILESC1CCC(CC1)c1nc2nc(nc(-c3ccccc3)c2[nH]1)-c1ccccc1