Reaction Details
TargetBeta-glucosidase
LigandBDBM50186732
Substrate/Competitorn/a
Meas. Tech.ChEMBL_353428 (CHEMBL870034)
pH6.8±n/a
Ki>1000000±n/a nM
Commentsextracted
Citation Wang, RWQiu, XLBols, MOrtega-Caballero, FQing, FL Synthesis and biological evaluation of glycosidase inhibitors: gem-difluoromethylenated nojirimycin analogues. J Med Chem49:2989-97 (2006) 
 
Beta-glucosidase
Name:Beta-glucosidase
Synonyms:BGLS_WICAO
Type:PROTEIN
Mol. Mass.:89534.43
Organism:Hansenula anomala
Description:ChEMBL_353428
Residue:825
BDBM50186732
NameBDBM50186732
TypeSmall organic molecule
Emp. Form.C6H11F2NO2
Mol. Mass.167.1538
SMILESC[C@H]1NC[C@H](O)[C@@H](O)C1(F)F