Reaction Details
TargetAdenosine receptor A2b
LigandBDBM50186974
Substrate/Competitorn/a
Meas. Tech.ChEMBL_376053 (CHEMBL864807)
IC50 12±n/a nM
Citation Esteve, CNueda, ADíaz, JLBeleta, JCárdenas, ALozoya, ECadavid, MILoza, MIRyder, HVidal, B New pyrrolopyrimidin-6-yl benzenesulfonamides: potent A2B adenosine receptor antagonists. Bioorg Med Chem Lett16:3642-5 (2006) 
 
Adenosine receptor A2b
Name:Adenosine receptor A2b
Type:G Protein-Coupled Receptor (GPCR)
Mol. Mass.:36341.22
Organism:Homo sapiens (Human)
Description:n/a
Residue:332
BDBM50186974
NameBDBM50186974
Synonyms:CHEMBL210969 | N-(1-(4-fluorobenzyl)piperidin-4-yl)-4-(1,3-diethyl-2,4-dioxo-2,3,4,5-tetrahydro-1H-pyrrolo[3,2-d]pyrimidin-6-yl)benzenesulfonamide
TypeSmall organic molecule
Emp. Form.C28H32FN5O4S
Mol. Mass.553.648
SMILESCCn1c2cc([nH]c2c(=O)n(CC)c1=O)-c1ccc(cc1)S(=O)(=O)NC1CCN(Cc2ccc(F)cc2)CC1