Reaction Details
Target5-hydroxytryptamine receptor 6
LigandBDBM50187072
Substrate/Competitorn/a
Meas. Tech.ChEMBL_375580 (CHEMBL871427)
Ki 0.8±n/a nM
Citation Siripurapu, UKolanos, RDukat, MRoth, BLGlennon, RA Binding of methoxy-substituted N1-benzenesulfonylindole analogs at human 5-HT6 serotonin receptors. Bioorg Med Chem Lett16:3793-6 (2006) 
 
5-hydroxytryptamine receptor 6
Name:5-hydroxytryptamine receptor 6
Type:G Protein-Coupled Receptor (GPCR)
Mol. Mass.:46968.43
Organism:Homo sapiens (Human)
Description:P50406
Residue:440
BDBM50187072
NameBDBM50187072
Synonyms:4-(4,6-dimethoxy-1H-indol-1-ylsulfonyl)benzenamine | CHEMBL210733
TypeSmall organic molecule
Emp. Form.C16H16N2O4S
Mol. Mass.332.374
SMILESCOc1cc(OC)c2ccn(c2c1)S(=O)(=O)c1ccc(N)cc1