Reaction Details
TargetReceptor-type tyrosine-protein kinase FLT3
LigandBDBM50187346
Substrate/Competitorn/a
Meas. Tech.ChEMBL_357668 (CHEMBL854264)
IC50>30000±n/a nM
Citation Mahboobi, SUecker, ASellmer, ACénac, CHöcher, HPongratz, HEichhorn, EHufsky, HTrümpler, ASicker, MHeidel, FFischer, TStocking, CElz, SBöhmer, FDDove, S Novel bis(1H-indol-2-yl)methanones as potent inhibitors of FLT3 and platelet-derived growth factor receptor tyrosine kinase. J Med Chem49:3101-15 (2006) 
 
Receptor-type tyrosine-protein kinase FLT3
Name:Receptor-type tyrosine-protein kinase FLT3
Type:Enzyme
Mol. Mass.:112888.62
Organism:Homo sapiens (Human)
Description:P36888
Residue:993
BDBM50187346
NameBDBM50187346
Synonyms:(5-Fluoro-1H-indol-2-yl)-(5-methoxy-1H-indol-2-yl)-methane | CHEMBL208712
TypeSmall organic molecule
Emp. Form.C18H15FN2O
Mol. Mass.294.3229
SMILESCOc1ccc2[nH]c(Cc3cc4cc(F)ccc4[nH]3)cc2c1