Reaction Details
TargetPlatelet-derived growth factor receptor beta
LigandBDBM50187357
Substrate/Competitorn/a
Meas. Tech.ChEMBL_357671 (CHEMBL854267)
IC50 1200±n/a nM
Citation Mahboobi, SUecker, ASellmer, ACénac, CHöcher, HPongratz, HEichhorn, EHufsky, HTrümpler, ASicker, MHeidel, FFischer, TStocking, CElz, SBöhmer, FDDove, S Novel bis(1H-indol-2-yl)methanones as potent inhibitors of FLT3 and platelet-derived growth factor receptor tyrosine kinase. J Med Chem49:3101-15 (2006) 
 
Platelet-derived growth factor receptor beta
Name:Platelet-derived growth factor receptor beta
Type:Enzyme
Mol. Mass.:123922.25
Organism:Homo sapiens (Human)
Description:P09619
Residue:1106
BDBM50187357
NameBDBM50187357
Synonyms:(4-Methyl-1H-indol-2-yl)-[5-(2-piperidin-1-yl-ethoxy)-1H-indol-2-yl]-methanone | CHEMBL210420
TypeSmall organic molecule
Emp. Form.C25H27N3O2
Mol. Mass.401.5008
SMILESCc1cccc2[nH]c(cc12)C(=O)c1cc2cc(OCCN3CCCCC3)ccc2[nH]1