Reaction Details
TargetPlatelet-derived growth factor receptor alpha/beta
LigandBDBM50187360
Substrate/Competitorn/a
Meas. Tech.ChEMBL_357669 (CHEMBL854265)
IC50>30000±n/a nM
Citation Mahboobi, SUecker, ASellmer, ACénac, CHöcher, HPongratz, HEichhorn, EHufsky, HTrümpler, ASicker, MHeidel, FFischer, TStocking, CElz, SBöhmer, FDDove, S Novel bis(1H-indol-2-yl)methanones as potent inhibitors of FLT3 and platelet-derived growth factor receptor tyrosine kinase. J Med Chem49:3101-15 (2006) 
 
Platelet-derived growth factor receptor alpha/beta
Name:Platelet-derived growth factor receptor alpha/beta
Type:n/a
Mol. Mass.:n/a
Description:ASSAY_ID of EBI is 454
Components:This complex has 2 components.
Component 1
Name:Platelet-derived growth factor receptor beta
Synonyms:2.7.10.1 Beta-type platelet-derived growth factor receptor CD140b antigen PDGF-R-beta PDGFR-beta Pdgfr Pdgfrb Platelet-derived growth factor receptor | Platelet-derived growth factor receptor 1
Type:Enzyme
Mol. Mass.:122771.00
Organism:Mus musculus (mouse)
Description:P05622
Residue:1098
Component 2
Name:Platelet-derived growth factor receptor alpha
Synonyms:PGFRA_MOUSE Platelet-derived growth factor receptor
Type:PROTEIN
Mol. Mass.:122646.66
Organism:Mus musculus
Description:EBI_12628
Residue:1089
BDBM50187360
NameBDBM50187360
Synonyms:(7-Chloro-1H-indol-2-yl)-(5-methoxy-1H-indol-2-yl)-methanone | CHEMBL381997
TypeSmall organic molecule
Emp. Form.C18H13ClN2O2
Mol. Mass.324.761
SMILESCOc1ccc2[nH]c(cc2c1)C(=O)c1cc2cccc(Cl)c2[nH]1