Reaction Details
TargetReceptor-type tyrosine-protein kinase FLT3
LigandBDBM50187356
Substrate/Competitorn/a
Meas. Tech.ChEMBL_357668 (CHEMBL854264)
IC50 1500±n/a nM
Citation Mahboobi, SUecker, ASellmer, ACénac, CHöcher, HPongratz, HEichhorn, EHufsky, HTrümpler, ASicker, MHeidel, FFischer, TStocking, CElz, SBöhmer, FDDove, S Novel bis(1H-indol-2-yl)methanones as potent inhibitors of FLT3 and platelet-derived growth factor receptor tyrosine kinase. J Med Chem49:3101-15 (2006) 
 
Receptor-type tyrosine-protein kinase FLT3
Name:Receptor-type tyrosine-protein kinase FLT3
Type:Enzyme
Mol. Mass.:112888.62
Organism:Homo sapiens (Human)
Description:P36888
Residue:993
BDBM50187356
NameBDBM50187356
Synonyms:(5-Fluoro-1H-indol-2-yl)-[5-(2-piperidin-1-yl-ethoxy)-1H-indol-2-yl]-methanone | CHEMBL209084
TypeSmall organic molecule
Emp. Form.C24H24FN3O2
Mol. Mass.405.4647
SMILESFc1ccc2[nH]c(cc2c1)C(=O)c1cc2cc(OCCN3CCCCC3)ccc2[nH]1