Reaction Details
TargetReceptor-type tyrosine-protein kinase FLT3
LigandBDBM50187354
Substrate/Competitorn/a
Meas. Tech.ChEMBL_357668 (CHEMBL854264)
IC50 6700±n/a nM
Citation Mahboobi, SUecker, ASellmer, ACénac, CHöcher, HPongratz, HEichhorn, EHufsky, HTrümpler, ASicker, MHeidel, FFischer, TStocking, CElz, SBöhmer, FDDove, S Novel bis(1H-indol-2-yl)methanones as potent inhibitors of FLT3 and platelet-derived growth factor receptor tyrosine kinase. J Med Chem49:3101-15 (2006) 
 
Receptor-type tyrosine-protein kinase FLT3
Name:Receptor-type tyrosine-protein kinase FLT3
Type:Enzyme
Mol. Mass.:112888.62
Organism:Homo sapiens (Human)
Description:P36888
Residue:993
BDBM50187354
NameBDBM50187354
Synonyms:CHEMBL377873 | [5-(2-Dimethylaminoethoxy)-1H-indol-2-yl]-(6-methoxy-1H-indol-2-yl)-methanone
TypeSmall organic molecule
Emp. Form.C22H23N3O3
Mol. Mass.377.4363
SMILESCOc1ccc2cc([nH]c2c1)C(=O)c1cc2cc(OCCN(C)C)ccc2[nH]1