Reaction Details
TargetReceptor-type tyrosine-protein kinase FLT3
LigandBDBM50187351
Substrate/Competitorn/a
Meas. Tech.ChEMBL_357668 (CHEMBL854264)
IC50 40±n/a nM
Citation Mahboobi, SUecker, ASellmer, ACénac, CHöcher, HPongratz, HEichhorn, EHufsky, HTrümpler, ASicker, MHeidel, FFischer, TStocking, CElz, SBöhmer, FDDove, S Novel bis(1H-indol-2-yl)methanones as potent inhibitors of FLT3 and platelet-derived growth factor receptor tyrosine kinase. J Med Chem49:3101-15 (2006) 
 
Receptor-type tyrosine-protein kinase FLT3
Name:Receptor-type tyrosine-protein kinase FLT3
Type:Enzyme
Mol. Mass.:112888.62
Organism:Homo sapiens (Human)
Description:P36888
Residue:993
BDBM50187351
NameBDBM50187351
Synonyms:Bis-(5-hydroxy-1H-indol-2-yl)-methanone | CHEMBL377193
TypeSmall organic molecule
Emp. Form.C17H12N2O3
Mol. Mass.292.2888
SMILESOc1ccc2[nH]c(cc2c1)C(=O)c1cc2cc(O)ccc2[nH]1