Reaction Details
TargetMetabotropic glutamate receptor 5
LigandBDBM50156068
Substrate/Competitorn/a
Meas. Tech.ChEMBL_361060 (CHEMBL859182)
EC50 38±n/a nM
Citation de Paulis, THemstapat, KChen, YZhang, YSaleh, SAlagille, DBaldwin, RMTamagnan, GDConn, PJ Substituent effects of N-(1,3-diphenyl-1H-pyrazol-5-yl)benzamides on positive allosteric modulation of the metabotropic glutamate-5 receptor in rat cortical astrocytes. J Med Chem49:3332-44 (2006) 
 
Metabotropic glutamate receptor 5
Name:Metabotropic glutamate receptor 5
Type:Enzyme
Mol. Mass.:131900.14
Organism:Rattus norvegicus (Rat)
Description:P31424
Residue:1203
BDBM50156068
NameBDBM50156068
Synonyms:CHEMBL190326 N-(2,5-Diphenyl-2H-pyrazol-3-yl)-4-trifluoromethyl-benzamide
TypeSmall organic molecule
Emp. Form.C23H16F3N3O
Mol. Mass.407.3878
SMILESFC(F)(F)c1ccc(cc1)C(=O)Nc1cc(nn1-c1ccccc1)-c1ccccc1