Reaction Details
TargetMetabotropic glutamate receptor 5
LigandBDBM50187621
Substrate/Competitorn/a
Meas. Tech.ChEMBL_361060 (CHEMBL859182)
EC50 62±n/a nM
Citation de Paulis, THemstapat, KChen, YZhang, YSaleh, SAlagille, DBaldwin, RMTamagnan, GDConn, PJ Substituent effects of N-(1,3-diphenyl-1H-pyrazol-5-yl)benzamides on positive allosteric modulation of the metabotropic glutamate-5 receptor in rat cortical astrocytes. J Med Chem49:3332-44 (2006) 
 
Metabotropic glutamate receptor 5
Name:Metabotropic glutamate receptor 5
Type:Enzyme
Mol. Mass.:131900.14
Organism:Rattus norvegicus (Rat)
Description:P31424
Residue:1203
BDBM50187621
NameBDBM50187621
Synonyms:CHEMBL377307 | N-(1-(2-chlorophenyl)-3-phenyl-1H-pyrazol-3-yl)benzamide
TypeSmall organic molecule
Emp. Form.C22H16ClN3O
Mol. Mass.373.835
SMILESClc1ccccc1-n1nc(cc1NC(=O)c1ccccc1)-c1ccccc1