Reaction Details
TargetMetabotropic glutamate receptor 5
LigandBDBM50187625
Substrate/Competitorn/a
Meas. Tech.ChEMBL_361060 (CHEMBL859182)
EC50 40±n/a nM
Citation de Paulis, THemstapat, KChen, YZhang, YSaleh, SAlagille, DBaldwin, RMTamagnan, GDConn, PJ Substituent effects of N-(1,3-diphenyl-1H-pyrazol-5-yl)benzamides on positive allosteric modulation of the metabotropic glutamate-5 receptor in rat cortical astrocytes. J Med Chem49:3332-44 (2006) 
 
Metabotropic glutamate receptor 5
Name:Metabotropic glutamate receptor 5
Type:Enzyme
Mol. Mass.:131900.14
Organism:Rattus norvegicus (Rat)
Description:P31424
Residue:1203
BDBM50187625
NameBDBM50187625
Synonyms:4-nitro-N-(1-(2-chlorophenyl)-3-phenyl-1H-pyrazol-5-yl)benzamide | CHEMBL207334
TypeSmall organic molecule
Emp. Form.C22H15ClN4O3
Mol. Mass.418.833
SMILES[O-][N+](=O)c1ccc(cc1)C(=O)Nc1cc(nn1-c1ccccc1Cl)-c1ccccc1