Reaction Details
TargetKelch-like ECH-associated protein 1
LigandBDBM50006932
Substrate/Competitorn/a
Meas. Tech.ChEMBL_2253028 (CHEMBL5167238)
Kd 20±n/a nM
Citation Georgakopoulos, NTalapatra, SDikovskaya, DDayalan Naidu, SHiggins, MGatliff, JAyhan, ANikoloudaki, RSchaap, MValko, KJavid, FDinkova-Kostova, ATKozielski, FWells, G Phenyl Bis-Sulfonamide Keap1-Nrf2 Protein-Protein Interaction Inhibitors with an Alternative Binding Mode. J Med Chem65:7380-7398 (2022) 
 
Kelch-like ECH-associated protein 1
Name:Kelch-like ECH-associated protein 1
Type:PROTEIN
Mol. Mass.:69664.53
Organism:Homo sapiens (Human)
Description:ChEMBL_107924
Residue:624
BDBM50006932
NameBDBM50006932
Synonyms:CHEMBL3237245
TypeSmall organic molecule
Emp. Form.C28H26N2O10S2
Mol. Mass.614.643
SMILESCOc1ccc(cc1)S(=O)(=O)N(CC(O)=O)c1ccc(N(CC(O)=O)S(=O)(=O)c2ccc(OC)cc2)c2ccccc12