Reaction Details
TargetGenome polyprotein
LigandBDBM50187930
Substrate/Competitorn/a
Meas. Tech.ChEMBL_388024 (CHEMBL869782)
Ki 19±n/a nM
Citation Arasappan, ANjoroge, FGChen, KXVenkatraman, SParekh, TNGu, HPichardo, JButkiewicz, NProngay, AMadison, VGirijavallabhan, V P2-P4 macrocyclic inhibitors of hepatitis C virus NS3-4A serine protease. Bioorg Med Chem Lett16:3960-5 (2006) 
 
Genome polyprotein
Name:Genome polyprotein
Type:Protein
Mol. Mass.:67067.41
Organism:Hepatitis C virus
Description:A3EZI9
Residue:631
BDBM50187930
NameBDBM50187930
Synonyms:4-{(7R,9S,12S)-9-[1-((S)-dimethylcarbamoyl-phenyl-methyl)-carbamoyl]-methyl}-aminooxalyl)-butylcarbamoyl)-11,14-dioxo-2,6-dioxa-10,13-diaza-tricyclo[14.3.1.1*7,10*]henicosa-1(19),16(20),17-trien-12-yl)-cyclohexanecarboxylic acid | CHEMBL3085034
TypeSmall organic molecule
Emp. Form.C43H56N6O11
Mol. Mass.832.9383
SMILES[H][C@@]12C[C@H](N(C1)C(=O)[C@@]([H])(NC(=O)Cc1cccc(OCCCO2)c1)[C@@]1([H])CC[C@@H](CC1)C(O)=O)C(=O)NC(CCC)C(=O)C(=O)NCC(=O)N[C@H](C(=O)N(C)C)c1ccccc1