Reaction Details
TargetCathepsin S
LigandBDBM50188293
Substrate/Competitorn/a
Meas. Tech.ChEMBL_379269 (CHEMBL866102)
Ki 9500±n/a nM
Citation Setti, ELVenkatraman, SPalmer, JTXie, XCheung, HYu, WWesolowski, GRobichaud, J Design and synthesis of tetracyclic nonpeptidic biaryl nitrile inhibitors of cathepsin K. Bioorg Med Chem Lett16:4296-9 (2006) 
 
Cathepsin S
Name:Cathepsin S
Type:Protein
Mol. Mass.:37507.38
Organism:Homo sapiens (Human)
Description:P25774
Residue:331
BDBM50188293
NameBDBM50188293
Synonyms:(R,S)-4-methyl-2-[4'-(2-piperazin-1-yl-thiazol-4-yl)-biphenyl-3-yl]-pentanoic acid cyanomethyl-amide | CHEMBL211737
TypeSmall organic molecule
Emp. Form.C27H31N5OS
Mol. Mass.473.633
SMILESCC(C)CC(C(=O)NCC#N)c1cccc(c1)-c1ccc(cc1)-c1csc(n1)N1CCNCC1