Reaction Details
TargetMelatonin receptor type 1B
LigandBDBM50188411
Substrate/Competitorn/a
Meas. Tech.ChEMBL_362910 (CHEMBL866345)
Ki 1.15±n/a nM
Citation Tsotinis, AVlachou, MPapahatjis, DPCalogeropoulou, TNikas, SPGarratt, PJPiccio, VVonhoff, SDavidson, KTeh, MTSugden, D Mapping the melatonin receptor. 7. Subtype selective ligands based on beta-substituted N-acyl-5-methoxytryptamines and beta-substituted N-acyl-5-methoxy-1-methyltryptamines. J Med Chem49:3509-19 (2006) 
 
Melatonin receptor type 1B
Name:Melatonin receptor type 1B
Type:Enzyme
Mol. Mass.:40203.54
Organism:Homo sapiens (Human)
Description:P49286
Residue:362
BDBM50188411
NameBDBM50188411
Synonyms:CHEMBL426127 | N-(2-[5-methoxy-1-methyl-1H-indol-3-yl]-2-methylpropyl)-propanamide
TypeSmall organic molecule
Emp. Form.C17H24N2O2
Mol. Mass.288.3847
SMILESCCC(=O)NCC(C)(C)c1cn(C)c2ccc(OC)cc12