Reaction Details
TargetMelatonin receptor type 1A
LigandBDBM50188402
Substrate/Competitorn/a
Meas. Tech.ChEMBL_362909 (CHEMBL866344)
Ki 4.9±n/a nM
Citation Tsotinis, AVlachou, MPapahatjis, DPCalogeropoulou, TNikas, SPGarratt, PJPiccio, VVonhoff, SDavidson, KTeh, MTSugden, D Mapping the melatonin receptor. 7. Subtype selective ligands based on beta-substituted N-acyl-5-methoxytryptamines and beta-substituted N-acyl-5-methoxy-1-methyltryptamines. J Med Chem49:3509-19 (2006) 
 
Melatonin receptor type 1A
Name:Melatonin receptor type 1A
Type:Enzyme
Mol. Mass.:39392.94
Organism:Homo sapiens (Human)
Description:P48039
Residue:350
BDBM50188402
NameBDBM50188402
Synonyms:CHEMBL379616 | N-(2-[5-methoxy-1-methyl-1H-indol-3-yl]propyl)propanamide
TypeSmall organic molecule
Emp. Form.C16H22N2O2
Mol. Mass.274.3581
SMILESCCC(=O)NCC(C)c1cn(C)c2ccc(OC)cc12