Reaction Details
TargetMelatonin receptor type 1A
LigandBDBM50188404
Substrate/Competitorn/a
Meas. Tech.ChEMBL_362909 (CHEMBL866344)
Ki 302±n/a nM
Citation Tsotinis, AVlachou, MPapahatjis, DPCalogeropoulou, TNikas, SPGarratt, PJPiccio, VVonhoff, SDavidson, KTeh, MTSugden, D Mapping the melatonin receptor. 7. Subtype selective ligands based on beta-substituted N-acyl-5-methoxytryptamines and beta-substituted N-acyl-5-methoxy-1-methyltryptamines. J Med Chem49:3509-19 (2006) 
 
Melatonin receptor type 1A
Name:Melatonin receptor type 1A
Type:Enzyme
Mol. Mass.:39392.94
Organism:Homo sapiens (Human)
Description:P48039
Residue:350
BDBM50188404
NameBDBM50188404
Synonyms:CHEMBL382555 | N-(2-[5-methoxy-1-methyl-1H-indol-3-yl]-2,2-tetramethyleneethyl)propanamide
TypeSmall organic molecule
Emp. Form.C19H26N2O2
Mol. Mass.314.4219
SMILESCCC(=O)NCC1(CCCC1)c1cn(C)c2ccc(OC)cc12