Reaction Details
TargetMelatonin receptor type 1A
LigandBDBM50188395
Substrate/Competitorn/a
Meas. Tech.ChEMBL_362909 (CHEMBL866344)
Ki 493±n/a nM
Citation Tsotinis, AVlachou, MPapahatjis, DPCalogeropoulou, TNikas, SPGarratt, PJPiccio, VVonhoff, SDavidson, KTeh, MTSugden, D Mapping the melatonin receptor. 7. Subtype selective ligands based on beta-substituted N-acyl-5-methoxytryptamines and beta-substituted N-acyl-5-methoxy-1-methyltryptamines. J Med Chem49:3509-19 (2006) 
 
Melatonin receptor type 1A
Name:Melatonin receptor type 1A
Type:Enzyme
Mol. Mass.:39392.94
Organism:Homo sapiens (Human)
Description:P48039
Residue:350
BDBM50188395
NameBDBM50188395
Synonyms:CHEMBL377809 | N-(2-[5-methoxy-1H-indol-3-yl]-2,2-trimethyleneethyl)cyclobutanecarboxamide
TypeSmall organic molecule
Emp. Form.C19H24N2O2
Mol. Mass.312.4061
SMILESCOc1ccc2[nH]cc(c2c1)C1(CNC(=O)C2CCC2)CCC1