Reaction Details
TargetMelatonin receptor type 1B
LigandBDBM50188405
Substrate/Competitorn/a
Meas. Tech.ChEMBL_362910 (CHEMBL866345)
Ki 138±n/a nM
Citation Tsotinis, AVlachou, MPapahatjis, DPCalogeropoulou, TNikas, SPGarratt, PJPiccio, VVonhoff, SDavidson, KTeh, MTSugden, D Mapping the melatonin receptor. 7. Subtype selective ligands based on beta-substituted N-acyl-5-methoxytryptamines and beta-substituted N-acyl-5-methoxy-1-methyltryptamines. J Med Chem49:3509-19 (2006) 
 
Melatonin receptor type 1B
Name:Melatonin receptor type 1B
Type:Enzyme
Mol. Mass.:40203.54
Organism:Homo sapiens (Human)
Description:P49286
Residue:362
BDBM50188405
NameBDBM50188405
Synonyms:CHEMBL382579 | N-(2-[5-methoxy-1-methyl-1H-indol-3-yl]-2,2-trimethyleneethyl)cyclopropanecarboxamide
TypeSmall organic molecule
Emp. Form.C19H24N2O2
Mol. Mass.312.4061
SMILESCOc1ccc2n(C)cc(c2c1)C1(CNC(=O)C2CC2)CCC1