Reaction Details
TargetAdenosine receptor A2b
LigandBDBM50188562
Substrate/Competitorn/a
Meas. Tech.ChEMBL_364154 (CHEMBL870844)
Ki 9±n/a nM
Citation Kalla, RVElzein, EPerry, TLi, XPalle, VVarkhedkar, VGimbel, AMaa, TZeng, DZablocki, J Novel 1,3-disubstituted 8-(1-benzyl-1H-pyrazol-4-yl) xanthines: high affinity and selective A2B adenosine receptor antagonists. J Med Chem49:3682-92 (2006) 
 
Adenosine receptor A2b
Name:Adenosine receptor A2b
Type:G Protein-Coupled Receptor (GPCR)
Mol. Mass.:36341.22
Organism:Homo sapiens (Human)
Description:n/a
Residue:332
BDBM50188562
NameBDBM50188562
Synonyms:1,3-Dipropyl-8-(1H-pyrazol-4-yl)-1H-purine-2,6(3H,7H)-dione | CHEMBL380176
TypeSmall organic molecule
Emp. Form.C14H18N6O2
Mol. Mass.302.3317
SMILESCCCn1c2nc([nH]c2c(=O)n(CCC)c1=O)-c1cn[nH]c1