Reaction Details
TargetCarbonic anhydrase 9
LigandBDBM50017811
Substrate/Competitorn/a
Meas. Tech.ChEMBL_390421 (CHEMBL869846)
Ki 23000±n/a nM
Citation Temperini, CInnocenti, AScozzafava, ASupuran, CT N-hydroxyurea--a versatile zinc binding function in the design of metalloenzyme inhibitors. Bioorg Med Chem Lett16:4316-20 (2006) 
 
Carbonic anhydrase 9
Name:Carbonic anhydrase 9
Type:Enzyme
Mol. Mass.:49669.03
Organism:Homo sapiens (Human)
Description:Catalytic domain of human cloned isozyme was used in the assay
Residue:459
BDBM50017811
NameBDBM50017811
Synonyms:CHEMBL467 US10155732, Compound HU | hydroxyurea
TypeSmall organic molecule
Emp. Form.CH4N2O2
Mol. Mass.76.0547
SMILESNC(=O)NO