Reaction Details
TargetC-X-C chemokine receptor type 2
LigandBDBM50200878
Substrate/Competitorn/a
Meas. Tech.ChEMBL_2260009 (CHEMBL5215020)
Kd 0.049000±n/a nM
Citation Chasák, J?lachtová, VUrban, MBrulíková, L Squaric acid analogues in medicinal chemistry. Eur J Med Chem209:0 (2021) 
 
C-X-C chemokine receptor type 2
Name:C-X-C chemokine receptor type 2
Type:Protein
Mol. Mass.:40767.88
Organism:Homo sapiens (Human)
Description:P25025
Residue:360
BDBM50200878
NameBDBM50200878
Synonyms:(R)-3-(2-(1-(furan-2-yl)propylamino)-3,4-dioxocyclobut-1-enylamino)-2-hydroxy-N,N-dimethylbenzamide | CHEMBL218115
TypeSmall organic molecule
Emp. Form.C20H21N3O5
Mol. Mass.383.3978
SMILESCC[C@@H](Nc1c(Nc2cccc(C(=O)N(C)C)c2O)c(=O)c1=O)c1ccco1