Reaction Details
TargetHistone deacetylase 1
LigandBDBM50569838
Substrate/Competitorn/a
Meas. Tech.ChEMBL_2260048 (CHEMBL5215059)
IC50 10.0±n/a nM
Citation Bass, AKAEl-Zoghbi, MSNageeb, EMMohamed, MFABadr, MAbuo-Rahma, GEA Comprehensive review for anticancer hybridized multitargeting HDAC inhibitors. Eur J Med Chem209:0 (2021) 
 
Histone deacetylase 1
Name:Histone deacetylase 1
Type:Enzyme
Mol. Mass.:55090.27
Organism:Homo sapiens (Human)
Description:Q13547
Residue:482
BDBM50569838
NameBDBM50569838
Synonyms:EDO-S 101 EDO-S101 | Tinostamustine
TypeSmall organic molecule
Emp. Form.C19H28Cl2N4O2
Mol. Mass.415.357
SMILESCn1c(CCCCCCC(=O)NO)nc2cc(ccc12)N(CCCl)CCCl