Reaction Details
TargetEpidermal growth factor receptor
LigandBDBM19149
Substrate/Competitorn/a
Meas. Tech.ChEMBL_2260083 (CHEMBL5215094)
IC50 12±n/a nM
Citation Bass, AKAEl-Zoghbi, MSNageeb, EMMohamed, MFABadr, MAbuo-Rahma, GEA Comprehensive review for anticancer hybridized multitargeting HDAC inhibitors. Eur J Med Chem209:0 (2021) 
 
Epidermal growth factor receptor
Name:Epidermal growth factor receptor
Type:Receptor Kinase Domain
Mol. Mass.:134279.59
Organism:Homo sapiens (Human)
Description:P00533
Residue:1210
BDBM19149
NameBDBM19149
Synonyms:CHEMBL98 SAHA US10188756, Compound SAHA US11505523, Compound SAHA US9353061, SAHA US9695181, Vorinostat Zolinza suberoylanilide hydroxamic acid
TypeSmall organic molecule
Emp. Form.C14H20N2O3
Mol. Mass.264.3202
SMILESONC(=O)CCCCCCC(=O)Nc1ccccc1